Afib_Flutter,Ageyears,ALT,AST,Asthma,Autoimmine_diseases,BMI,CAD_Hx,CKD_Total,COPD,COVID_CT_N,CRP_Peak,CXR,Days_Until_Intubation,Days_Until_Death,Days_since_symptom_onset–to–PCR,Ddimer,Ddimer_Peak,Death,Intubation,DM,ESRD,Gender,Hematologic_malignancy,Hemoglibinopathy,HFpEF,HFrEF,HIV,HTN,Hydroxychloroquine,Immunosuppressed_patients,LDH,LDH_Peak,Nursing_home,Peak_Ferritin,Plt,Race,Remdesivir,Severity_Oxygen_Requ,Smoking_Hx,Solid_malignancy,Solid_Organ_Transplant,Steroids,Symptoms_GI,Symptoms_Neuro,Symptoms_Systemic,Symptoms_URI,Temp_Admission,Temp_Max,Tocilizumab,WBC
0,73,,,0,0,31.2,0,0,0,35.6,,2.0,,4.0,3,,,1,0,0,0,1,0,0,0,0,0,1,1.0,1,,,0,4567.0,211000.0,1,0.0,2,0,1,0,1.0,0,1,0,0.0,38.5,36.4,0.0,13800.0
0,75,,,0,0,30.8,0,0,0,31.2,571.0,2.0,0.0,9.0,4,,35.2,1,1,0,0,2,0,0,0,0,0,1,1.0,0,1109.0,1109.0,0,1654.0,152000.0,1,0.0,1,0,0,0,1.0,0,0,1,1.0,36.6,37.2,0.0,31600.0
0,68,15.0,22.0,0,0,30.0,0,1,0,38.8,154.5,1.0,0.0,8.0,9,15.22,15.22,1,1,0,0,2,0,0,0,0,0,1,0.0,0,298.0,298.0,0,545.2,112000.0,1,0.0,1,0,0,0,0.0,0,1,0,0.0,36.8,39.1,0.0,9800.0
0,72,,,0,0,35.4,0,0,0,29.8,251.2,2.0,2.0,10.0,25,,10.26,1,1,1,0,2,0,0,0,0,0,1,0.0,0,781.0,781.0,0,464.8,151000.0,1,0.0,1,0,0,0,1.0,0,0,1,1.0,36.7,39.0,0.0,14700.0
0,63,19.0,31.0,0,0,29.0,0,1,0,24.2,343.7,1.0,3.0,11.0,11,7.09,7.09,1,1,1,1,2,0,0,0,0,0,1,1.0,0,843.0,1121.0,0,1749.0,173000.0,1,0.0,1,0,0,0,1.0,1,0,1,0.0,36.9,39.3,1.0,13000.0
0,83,36.0,153.0,0,0,39.1,1,1,0,26.4,143.4,2.0,,9.0,5,,,1,0,0,1,2,0,0,0,0,0,0,1.0,0,806.0,806.0,1,2036.0,245000.0,1,0.0,2,0,0,0,1.0,0,1,0,1.0,36.5,38.1,0.0,13400.0
1,62,14.0,47.0,0,0,30.0,1,0,0,38.3,172.9,0.0,6.0,12.0,3,,,1,1,1,0,1,0,0,0,1,0,1,0.0,0,496.0,1138.0,0,7500.0,126000.0,1,0.0,1,0,0,0,1.0,1,1,1,1.0,37.3,38.5,0.0,4300.0
1,81,,,0,0,24.6,1,0,0,23.3,33.7,2.0,,8.0,1,,,1,0,0,0,2,0,0,0,1,0,1,1.0,0,377.0,377.0,1,101.5,157000.0,1,0.0,2,0,0,0,1.0,0,1,0,0.0,36.4,37.7,0.0,5900.0
0,68,8.0,7.0,0,0,28.2,1,0,1,25.7,,2.0,8.0,17.0,8,,3.4,1,1,1,0,1,0,0,0,1,0,1,1.0,0,632.0,918.0,0,3948.0,73000.0,0,0.0,1,0,0,0,1.0,0,0,1,1.0,38.3,39.5,0.0,7300.0
0,44,13.0,13.0,0,0,107.3,0,0,0,33.3,326.6,1.0,0.0,13.0,1,0.69,0.69,1,1,1,0,2,0,0,0,0,0,0,1.0,0,657.0,657.0,0,161.5,270000.0,1,0.0,1,0,0,0,1.0,0,0,0,1.0,37.2,38.7,0.0,9800.0
0,87,,,0,0,26.6,0,0,0,33.1,,,5.0,9.0,6,,,1,1,1,0,2,0,0,0,0,0,1,1.0,0,,,0,,219000.0,1,0.0,1,0,0,0,1.0,1,1,1,1.0,39.0,39.0,0.0,11900.0
0,87,68.0,88.0,0,0,23.3,0,0,0,26.2,,2.0,5.0,9.0,7,,,1,1,1,0,2,0,0,0,0,0,1,1.0,0,,,0,,248000.0,0,0.0,1,0,0,0,1.0,1,1,1,1.0,39.0,39.0,0.0,102000.0
1,74,,,0,0,30.9,1,0,0,20.3,,,,18.0,1,,5.87,1,0,0,0,1,0,0,0,0,0,0,1.0,1,,,0,1797.0,45000.0,1,0.0,2,0,1,0,1.0,0,1,0,0.0,36.6,37.1,0.0,7500.0
0,91,23.0,24.0,0,0,25.8,0,0,0,24.2,260.3,1.0,,7.0,2,3.44,3.44,1,0,0,0,1,0,0,0,0,0,1,1.0,1,296.0,296.0,0,1442.7,270000.0,1,0.0,2,0,1,0,1.0,0,1,0,1.0,37.5,37.5,0.0,8800.0
0,76,,,0,0,29.9,0,0,1,38.0,159.8,2.0,4.0,14.0,6,6.31,6.31,1,1,1,0,2,0,0,0,0,0,0,0.0,0,370.0,417.0,0,1190.0,495000.0,1,0.0,1,0,0,0,1.0,0,1,0,1.0,36.2,37.6,0.0,9700.0
0,51,,,0,0,37.6,0,0,0,41.6,315.2,1.0,0.0,11.0,3,5.46,5.46,1,1,1,0,1,0,0,0,0,0,1,1.0,1,320.0,320.0,0,7181.0,197000.0,1,0.0,1,1,0,1,1.0,0,1,0,0.0,36.4,40.0,0.0,9800.0
0,83,46.0,83.0,0,0,28.4,0,0,0,28.0,,2.0,,3.0,6,11.13,11.13,1,0,0,0,1,0,0,0,0,0,1,1.0,0,538.0,538.0,1,291.2,247000.0,1,0.0,2,0,0,0,1.0,0,1,0,1.0,36.4,36.4,0.0,14100.0
1,63,20.0,32.0,0,0,30.0,0,1,1,31.4,160.0,2.0,0.0,1.0,8,31.46,31.46,1,1,1,0,1,0,0,0,0,0,1,1.0,0,628.0,628.0,0,335.0,48800.0,1,0.0,1,0,0,0,0.0,0,0,1,1.0,37.1,37.1,0.0,17100.0
0,63,27.0,24.0,0,0,45.5,0,1,0,41.4,327.2,2.0,4.0,39.0,32,,35.2,1,1,0,0,2,0,0,0,0,0,1,1.0,0,384.0,899.0,0,1312.3,166000.0,1,0.0,1,1,0,0,1.0,1,0,1,1.0,36.6,39.1,0.0,31800.0
1,63,30.0,89.0,0,0,20.5,0,0,0,22.5,,2.0,,2.0,4,5.3,5.3,1,0,0,0,1,0,0,1,0,0,1,1.0,1,604.0,604.0,0,1124.5,30000.0,1,0.0,2,0,1,0,0.0,0,1,0,1.0,36.7,37.7,0.0,4100.0
0,74,13.0,41.0,0,0,23.4,0,0,0,34.4,247.6,,11.0,14.0,9,8.49,17.16,1,1,1,0,2,0,0,0,0,0,1,0.0,1,353.0,522.0,0,5390.0,165000.0,1,0.0,1,0,1,0,1.0,0,0,1,1.0,37.0,38.8,0.0,7700.0
0,92,16.0,23.0,0,0,16.7,0,0,1,25.2,226.6,1.0,,11.0,3,35.2,,1,0,0,0,1,0,0,1,0,0,1,1.0,0,416.0,416.0,1,129.2,220000.0,1,0.0,2,0,0,0,1.0,0,1,1,1.0,39.3,39.3,0.0,7900.0
0,60,31.0,63.0,0,0,35.1,0,0,0,31.7,378.2,2.0,0.0,4.0,4,1.03,23.18,1,1,0,0,1,0,0,0,0,0,1,1.0,1,651.0,651.0,0,859.9,189000.0,1,0.0,1,0,1,0,1.0,1,0,1,1.0,39.3,39.3,0.0,9100.0
0,78,45.0,75.0,0,0,28.5,0,0,0,30.5,133.3,2.0,0.0,5.0,2,35.2,,1,1,0,0,1,0,0,0,0,0,1,1.0,0,838.0,838.0,0,1432.5,217000.0,1,0.0,1,0,0,0,1.0,0,1,1,1.0,36.4,39.4,0.0,10100.0
0,75,14.0,27.0,0,0,24.8,0,0,0,18.7,175.0,1.0,,16.0,3,,,1,0,0,0,1,0,0,0,0,0,1,0.0,0,268.0,412.0,1,470.8,310000.0,1,0.0,2,0,0,0,0.0,0,1,0,0.0,37.7,38.9,0.0,10900.0
0,72,114.0,407.0,0,0,26.0,0,0,0,23.2,146.5,1.0,,5.0,3,3.9,3.9,1,0,0,0,1,0,0,0,0,0,1,1.0,0,,,1,5649.0,68000.0,1,0.0,2,0,0,0,1.0,0,1,1,1.0,36.2,39.2,0.0,10900.0
0,69,,,0,1,26.9,0,1,1,36.3,285.6,1.0,9.0,16.0,20,,2.88,1,1,0,0,2,0,0,0,0,0,1,1.0,1,588.0,479.0,0,947.6,218000.0,1,0.0,1,1,0,0,1.0,1,0,1,1.0,37.6,38.5,0.0,11200.0
0,64,14.0,26.0,0,0,31.5,0,0,1,19.6,160.0,1.0,,6.0,2,,,1,0,0,0,2,0,0,0,0,0,1,1.0,0,,,1,172.8,126000.0,1,0.0,2,1,0,0,1.0,0,0,1,1.0,38.9,38.9,0.0,12200.0
0,71,48.0,70.0,0,0,26.7,0,1,0,25.8,85.0,1.0,3.0,12.0,8,,14.01,1,1,0,1,2,0,0,0,0,0,1,0.0,0,364.0,575.0,0,1170.4,238000.0,1,0.0,1,0,0,0,1.0,1,0,1,1.0,36.8,38.0,0.0,16600.0
0,69,10.0,23.0,0,0,36.5,0,0,0,32.7,160.0,2.0,,3.0,1,1.55,2.21,1,0,0,0,2,0,0,0,0,0,1,1.0,0,396.0,396.0,1,1071.5,365000.0,1,0.0,2,0,0,0,1.0,0,0,1,1.0,38.2,38.2,0.0,44000.0
0,74,27.0,53.0,0,1,28.3,0,0,1,25.2,423.5,2.0,,8.0,1,9.11,9.11,1,0,0,0,2,0,0,0,0,0,1,1.0,1,786.0,786.0,1,2436.0,361000.0,1,0.0,2,0,0,0,1.0,0,1,1,1.0,35.4,37.0,0.0,138000.0
0,80,51.0,76.0,0,0,26.9,0,0,0,29.6,87.6,2.0,,5.0,1,,2.94,1,0,0,0,1,0,0,0,0,0,1,1.0,0,330.0,330.0,1,142.6,205000.0,1,0.0,2,0,0,0,1.0,0,0,0,1.0,37.5,38.2,0.0,5500.0
0,77,36.0,88.0,0,0,28.1,0,1,0,27.1,,2.0,,5.0,5,30.95,30.95,1,0,0,1,1,0,0,0,0,1,0,1.0,1,460.0,460.0,0,2059.0,167000.0,1,0.0,2,0,0,0,0.0,0,0,0,1.0,36.4,38.9,0.0,6600.0
0,77,38.0,42.0,0,0,41.0,0,0,0,27.9,32.2,2.0,,18.0,7,35.2,35.2,1,0,0,0,1,0,0,0,1,0,1,0.0,0,467.0,467.0,1,972.2,279000.0,0,0.0,2,0,0,0,1.0,0,1,0,1.0,37.6,38.0,0.0,10800.0
0,78,62.0,171.0,0,0,22.5,0,1,0,36.0,160.0,2.0,,10.0,1,35.2,35.2,1,0,0,1,1,0,0,0,0,0,0,1.0,0,,,1,331.6,279000.0,1,0.0,2,1,0,0,1.0,0,1,0,1.0,36.3,37.2,0.0,16500.0
0,65,27.0,66.0,0,1,24.2,0,0,0,30.2,175.0,0.0,,8.0,1,0.36,,1,0,1,0,2,0,0,0,0,0,0,1.0,1,670.0,670.0,1,35.6,357000.0,1,0.0,2,0,0,0,1.0,1,0,1,1.0,39.2,39.2,0.0,18000.0
1,75,,,0,0,43.6,0,1,1,30.0,297.7,2.0,3.0,14.0,10,1.76,1.76,1,1,0,1,2,0,0,1,0,0,1,0.0,0,269.0,542.0,0,279.9,284000.0,1,0.0,1,0,0,0,1.0,1,0,0,1.0,37.1,39.4,0.0,19000.0
0,80,31.0,114.0,0,0,29.1,0,0,0,24.5,430.0,2.0,1.0,2.0,2,35.2,35.2,1,1,1,0,2,0,0,0,0,0,1,1.0,0,1555.0,1555.0,1,2436.0,555000.0,1,0.0,1,0,0,0,1.0,0,0,1,1.0,37.6,37.6,0.0,23200.0
0,84,24.0,71.0,0,0,30.2,1,0,0,30.4,170.5,2.0,3.0,8.0,2,4.27,11.39,1,1,1,0,2,1,0,1,0,0,1,1.0,1,456.0,518.0,0,806.8,137000.0,1,0.0,1,0,0,0,1.0,1,0,0,1.0,36.5,37.2,1.0,4900.0
0,73,12.0,24.0,1,0,32.7,1,1,1,31.9,161.5,1.0,3.0,8.0,2,12.59,12.59,1,1,1,0,2,0,0,0,0,0,1,1.0,0,294.0,424.0,0,7500.0,147000.0,2,0.0,1,0,0,0,1.0,0,1,1,1.0,36.9,38.4,0.0,4900.0
1,67,14.0,51.0,0,0,27.2,0,0,0,28.3,83.5,2.0,0.0,12.0,8,19.9,19.9,1,1,0,0,2,0,0,1,0,0,1,1.0,0,,,1,734.6,281000.0,1,0.0,1,0,0,0,1.0,0,1,0,1.0,36.7,37.8,0.0,7200.0
0,65,30.0,48.0,0,0,24.6,0,0,0,21.4,283.1,2.0,3.0,19.0,1,23.26,23.26,1,1,1,0,1,0,0,0,0,0,1,1.0,0,360.0,2470.0,1,1576.0,228000.0,1,0.0,1,0,0,0,1.0,0,1,1,0.0,38.9,41.5,0.0,7400.0
0,77,42.0,83.0,0,0,24.9,0,0,0,25.7,256.5,2.0,,8.0,1,1.18,1.18,1,0,0,0,1,0,0,0,0,0,1,1.0,0,676.0,676.0,1,493.4,336000.0,1,0.0,2,0,0,0,1.0,0,1,0,0.0,36.9,39.1,0.0,9800.0
1,69,15.0,13.0,0,0,21.0,0,1,0,23.8,218.7,1.0,,7.0,1,,17.53,1,0,1,1,2,0,0,0,0,0,1,1.0,0,397.0,465.0,1,814.6,338000.0,1,0.0,2,0,0,0,1.0,0,1,0,1.0,37.2,37.6,0.0,11100.0
0,51,35.0,61.0,0,0,21.6,0,0,0,36.6,294.6,2.0,2.0,47.0,2,1.07,30.76,1,1,0,0,1,0,0,0,0,0,1,1.0,0,744.0,744.0,1,1312.0,165000.0,1,0.0,1,0,0,0,1.0,0,0,1,1.0,37.0,39.5,0.0,12200.0
0,64,39.0,50.0,1,0,33.1,0,1,0,27.6,269.0,2.0,0.0,1.0,4,2.89,2.89,1,1,0,1,2,0,0,0,0,0,0,0.0,0,815.0,815.0,0,651.0,356000.0,1,0.0,1,0,0,0,1.0,0,0,0,1.0,39.5,39.5,0.0,12700.0
0,67,38.0,84.0,0,0,24.5,1,1,0,42.0,,2.0,,28.0,3,35.2,35.3,1,0,1,0,1,0,0,1,0,0,1,0.0,0,380.0,,1,,256000.0,1,0.0,2,0,0,0,0.0,0,0,1,1.0,37.0,37.4,0.0,14300.0
0,90,63.0,35.0,0,0,25.2,1,0,1,22.3,51.3,2.0,,1.0,1,,,1,0,0,0,1,0,0,1,0,0,1,1.0,0,241.0,241.0,0,524.9,182000.0,1,0.0,2,0,0,0,1.0,0,0,1,1.0,36.6,36.6,0.0,17000.0
0,67,22.0,25.0,0,0,34.8,0,1,0,27.7,260.7,2.0,5.0,20.0,10,2.71,14.04,1,1,1,1,1,0,0,0,0,0,1,1.0,0,425.0,921.0,1,978.0,165000.0,1,0.0,1,0,0,0,1.0,0,0,1,1.0,37.1,39.6,1.0,4700.0
0,85,11.0,39.0,0,0,17.7,1,0,1,29.2,121.0,1.0,,19.0,1,2.17,2.17,1,0,0,0,1,0,0,0,0,0,1,1.0,0,631.0,631.0,1,236.6,98000.0,1,0.0,2,0,0,0,1.0,0,0,1,1.0,38.5,38.5,0.0,5200.0
0,37,40.0,93.0,1,0,36.8,0,1,0,37.3,106.31,2.0,2.0,63.0,7,35.2,35.2,1,1,1,0,2,0,0,0,0,0,0,1.0,0,667.0,1560.0,0,1745.0,245000.0,2,0.0,1,0,0,0,1.0,0,0,1,1.0,39.0,42.2,1.0,6300.0
0,69,22.0,70.0,0,0,28.4,0,1,0,40.5,145.0,2.0,11.0,51.0,6,2.0,,1,1,0,0,1,0,0,0,0,0,1,1.0,0,400.0,400.0,1,1800.0,241000.0,1,0.0,1,0,0,0,1.0,0,0,1,1.0,39.3,39.3,0.0,7400.0
1,84,33.0,58.0,0,0,18.6,0,0,0,23.4,281.2,2.0,,3.0,1,5.26,5.26,1,0,0,0,1,0,0,1,0,0,1,1.0,0,413.0,413.0,1,778.7,182000.0,0,0.0,2,0,0,0,1.0,0,0,0,1.0,36.3,36.8,0.0,7800.0
0,92,198.0,277.0,0,0,23.9,0,0,0,25.7,,2.0,,1.0,2,8.46,8.46,1,0,0,0,1,0,0,0,0,0,1,1.0,0,1102.0,1102.0,1,7500.0,254000.0,2,0.0,2,0,0,0,0.0,0,0,0,1.0,37.1,38.5,0.0,8200.0
0,61,17.0,42.0,1,0,44.2,0,0,1,33.2,90.2,2.0,0.0,9.0,5,1.39,18.55,1,1,1,0,2,0,0,0,1,0,1,1.0,0,442.0,442.0,0,732.9,237000.0,1,0.0,1,0,0,0,1.0,0,0,0,1.0,40.2,40.2,0.0,9200.0
0,101,14.0,24.0,0,0,28.4,0,0,0,28.2,31.6,2.0,,5.0,1,23.91,23.91,1,0,0,0,1,0,0,0,0,0,1,1.0,0,223.0,223.0,1,297.9,220000.0,2,0.0,2,0,0,0,1.0,0,1,0,0.0,38.0,38.0,0.0,10100.0
0,76,60.0,214.0,0,0,30.6,1,0,0,34.3,73.68,2.0,0.0,1.0,2,,,1,1,0,0,2,0,0,0,0,0,1,0.0,0,,,0,7500.0,148000.0,1,0.0,1,1,0,0,0.0,0,0,1,1.0,36.4,36.4,0.0,10300.0
0,82,116.0,195.0,0,0,25.4,1,0,1,18.9,72.4,0.0,0.0,1.0,5,4.18,9.03,1,1,0,0,2,0,0,0,1,0,1,1.0,0,228.0,228.0,1,662.5,105000.0,1,0.0,1,0,0,0,1.0,0,1,0,1.0,36.9,36.9,0.0,10300.0
0,60,102.0,40.0,0,0,20.4,0,0,0,22.8,257.7,0.0,2.0,10.0,1,8.94,8.94,1,1,0,0,1,0,0,0,0,0,1,1.0,0,214.0,214.0,1,274.5,293000.0,1,0.0,1,0,0,0,1.0,0,1,0,0.0,36.8,37.7,0.0,14800.0
1,68,,,1,1,30.0,0,1,0,41.3,162.4,2.0,11.0,40.0,30,,15.11,1,1,1,0,1,1,1,1,0,1,1,1.0,1,341.0,1877.0,0,7459.0,58000.0,2,1.0,1,1,0,1,1.0,0,1,1,0.0,36.7,39.4,1.0,15100.0
0,74,,,1,0,28.0,0,1,0,34.1,,2.0,,29.0,10,15.0,20.0,1,0,0,0,1,0,0,0,0,0,0,0.0,0,700.0,,1,,240000.0,1,0.0,1,0,0,0,1.0,0,0,0,1.0,36.7,38.0,0.0,20000.0
0,91,7.0,24.0,0,0,28.7,1,0,0,25.9,88.2,1.0,9.0,9.0,2,1.15,1.15,1,1,0,0,2,0,0,1,0,0,1,1.0,1,305.0,311.0,0,152.8,230000.0,1,0.0,1,0,1,0,1.0,1,0,0,1.0,38.2,38.2,0.0,3700.0
0,87,9.0,22.0,0,0,19.7,0,0,0,25.8,185.1,1.0,,6.0,1,2.23,35.2,1,0,1,0,2,0,0,0,0,0,1,0.0,0,822.0,822.0,1,1458.7,180000.0,1,0.0,2,0,0,0,1.0,0,1,0,0.0,33.1,38.2,0.0,3800.0
0,69,39.0,85.0,0,0,30.5,0,0,0,17.9,371.5,1.0,0.0,0.0,2,8.25,8.25,1,1,0,0,2,0,0,0,0,0,1,0.0,0,564.0,564.0,1,1701.0,100000.0,1,0.0,1,1,0,0,1.0,0,0,0,1.0,37.0,37.0,0.0,5500.0
0,70,8.0,20.0,0,0,28.2,1,0,1,31.9,25.8,1.0,6.0,12.0,1,1.89,19.33,1,1,0,0,2,0,0,0,1,0,0,1.0,0,205.0,2187.0,0,138.1,182000.0,0,0.0,1,1,0,0,1.0,0,0,1,0.0,37.4,39.2,1.0,6100.0
1,76,10.0,25.0,0,0,46.7,0,0,0,36.0,112.59,1.0,2.0,2.0,7,5.6,5.6,1,1,0,0,2,0,0,0,0,0,1,1.0,0,333.0,333.0,0,1357.0,226000.0,1,0.0,1,0,0,0,0.0,0,0,0,1.0,36.4,37.7,0.0,9800.0
0,58,7.0,13.0,0,0,34.8,0,0,1,39.6,5.0,1.0,,1.0,2,3.76,3.76,1,0,1,0,2,0,0,0,0,0,1,1.0,0,25.0,25.0,1,533.4,162000.0,2,0.0,2,0,0,0,1.0,0,0,1,0.0,37.7,37.7,0.0,16000.0
0,80,8.0,17.0,0,0,38.1,0,0,0,21.9,440.5,2.0,0.0,1.0,3,4.05,4.05,1,1,1,0,2,0,0,0,0,0,1,0.0,0,390.0,390.0,0,174.3,263000.0,1,0.0,1,0,0,0,0.0,0,0,0,1.0,37.3,37.3,0.0,25900.0
1,72,194.0,357.0,0,0,22.1,1,0,0,25.1,144.33,2.0,1.0,1.0,2,0.74,3.65,1,1,1,0,1,0,0,0,1,0,0,0.0,0,1590.0,1590.0,1,1533.0,341000.0,1,0.0,2,0,0,0,1.0,0,0,0,1.0,36.6,36.7,0.0,7200.0
1,62,13.0,17.0,0,0,26.2,0,0,1,30.1,67.9,1.0,,9.0,2,0.75,0.75,1,0,0,0,1,0,0,0,1,0,1,1.0,0,267.0,267.0,0,297.5,120000.0,1,0.0,0,1,0,0,0.0,1,0,1,1.0,38.5,38.5,0.0,7300.0
0,68,32.0,111.0,0,0,29.8,0,0,0,43.4,111.1,2.0,9.0,12.0,2,1.69,2.78,1,1,0,0,1,1,0,0,0,0,0,1.0,1,616.0,619.0,0,3322.0,93000.0,0,0.0,1,0,1,0,1.0,1,0,1,1.0,36.4,38.1,1.0,9800.0
0,73,17.0,48.0,0,0,25.7,0,0,1,20.9,415.8,2.0,5.0,22.0,6,1.35,21.81,1,1,0,0,1,0,0,0,0,0,1,1.0,0,593.0,645.0,1,1742.0,339000.0,1,0.0,1,0,0,0,1.0,0,1,1,1.0,39.0,39.4,0.0,9900.0
1,95,14.0,70.0,0,0,32.4,0,1,0,20.7,151.0,1.0,,1.0,1,35.2,,1,0,0,1,2,0,0,0,0,0,1,1.0,0,745.0,745.0,1,1950.0,155000.0,1,0.0,2,0,0,0,0.0,0,0,0,1.0,36.5,38.2,0.0,10800.0
0,61,31.0,52.0,0,0,25.7,1,0,0,25.7,204.7,2.0,0.0,3.0,3,1.07,1.07,1,1,1,0,1,0,0,0,0,0,1,1.0,0,,,0,953.7,298000.0,1,0.0,1,0,0,0,1.0,0,0,1,1.0,39.4,39.4,0.0,11800.0
0,73,58.0,86.0,0,0,30.3,0,0,0,31.1,,1.0,0.0,11.0,2,2.5,28.05,1,1,0,0,1,0,0,0,0,0,0,1.0,0,,,0,,283000.0,1,0.0,1,0,0,0,1.0,0,0,0,1.0,38.0,39.5,0.0,12100.0
0,72,43.0,46.0,0,0,19.3,0,0,1,34.2,235.7,0.0,,5.0,1,7.28,11.69,1,0,1,0,1,0,0,0,0,0,1,1.0,0,342.0,342.0,1,682.5,268000.0,1,0.0,2,1,0,0,1.0,0,1,1,0.0,36.8,39.2,0.0,8300.0
0,46,6.0,16.0,0,0,47.6,0,0,0,19.5,,1.0,,12.0,1,8.26,8.26,1,0,1,0,1,0,0,0,0,0,1,1.0,0,,,1,7326.0,222000.0,1,0.0,2,0,0,0,1.0,0,1,0,1.0,36.8,37.5,0.0,11600.0
0,91,99.0,133.0,0,0,20.6,0,0,0,30.2,161.6,2.0,,3.0,2,35.2,,1,0,0,0,1,0,0,0,0,0,1,1.0,0,709.0,709.0,1,3194.0,179000.0,1,0.0,2,0,0,0,1.0,0,1,0,1.0,38.0,38.0,0.0,12500.0
0,63,,,0,0,33.1,0,0,0,23.2,240.5,2.0,2.0,3.0,3,0.39,0.39,1,1,1,0,2,0,0,0,0,0,1,1.0,0,561.0,561.0,0,598.2,222000.0,1,0.0,1,0,0,0,1.0,0,0,1,1.0,37.7,38.2,0.0,6000.0
0,71,219.0,124.0,0,0,30.6,0,1,0,24.7,281.0,2.0,2.0,23.0,19,20.35,21.1,1,1,1,1,1,0,0,1,0,0,1,1.0,1,753.0,753.0,0,5055.0,112000.0,2,0.0,1,0,1,0,1.0,0,0,0,1.0,36.8,39.0,0.0,13400.0
0,64,27.0,38.0,0,0,33.1,0,1,0,41.8,228.1,2.0,10.0,55.0,24,8.68,16.62,1,1,1,0,2,0,0,1,0,0,1,1.0,0,298.0,1107.0,0,3140.0,80000.0,1,0.0,1,1,0,0,1.0,0,0,1,1.0,39.6,39.6,0.0,26200.0
0,55,,,0,0,28.1,0,0,0,43.4,160.4,2.0,23.0,24.0,7,0.27,,1,1,0,0,2,0,0,0,0,0,1,1.0,0,289.0,9041.0,0,7500.0,173000.0,1,0.0,1,0,0,0,1.0,0,0,1,1.0,38.6,38.6,0.0,5600.0
0,76,18.0,35.0,0,0,23.4,0,0,0,20.7,224.0,2.0,1.0,2.0,5,,,1,1,1,0,1,0,0,1,0,0,1,1.0,0,131.0,131.0,1,3500.0,75000.0,1,0.0,1,0,0,0,1.0,0,0,1,0.0,36.4,37.2,0.0,7600.0
0,91,96.0,101.0,0,0,29.3,0,0,1,30.1,80.8,2.0,,27.0,1,1.72,11.72,1,0,0,0,2,0,0,0,0,0,1,1.0,0,706.0,706.0,1,351.6,187000.0,1,0.0,2,0,0,0,1.0,0,0,0,1.0,37.5,38.3,0.0,7900.0
0,75,36.0,33.0,0,0,20.3,0,0,0,37.7,,0.0,,8.0,1,16.09,16.09,1,0,0,0,1,0,0,0,0,0,1,0.0,0,188.0,188.0,1,2255.0,737000.0,1,0.0,2,0,0,0,0.0,0,1,0,0.0,37.5,38.7,0.0,12100.0
0,57,,,0,0,49.8,0,1,0,38.2,170.3,2.0,6.0,21.0,24,,2.77,1,1,1,0,1,0,0,0,0,0,1,1.0,0,1427.0,1427.0,1,524.3,247000.0,1,0.0,1,0,0,0,1.0,1,0,1,1.0,37.4,39.4,1.0,22400.0
0,87,4418.0,10000.0,0,0,24.7,0,0,0,39.0,120.9,2.0,0.0,3.0,6,35.2,35.2,1,1,1,0,1,0,0,0,0,0,1,0.0,0,6000.0,6000.0,0,3242.0,73000.0,1,0.0,1,0,0,0,1.0,0,1,1,1.0,35.5,36.6,0.0,11100.0
1,90,63.0,106.0,0,0,20.0,1,1,0,29.3,,2.0,0.0,12.0,1,35.0,35.0,1,1,0,1,1,0,0,0,0,0,0,1.0,0,445.0,445.0,1,1592.0,71000.0,1,0.0,1,0,0,0,1.0,0,1,1,1.0,39.0,39.0,0.0,4600.0
0,75,17.0,34.0,0,0,27.9,0,0,0,25.2,264.0,2.0,4.0,4.0,1,1.61,1.61,1,1,0,0,2,0,0,0,0,0,1,1.0,0,348.0,6000.0,0,2089.0,231000.0,1,0.0,1,1,0,0,1.0,0,1,1,0.0,38.6,38.7,0.0,6000.0
1,55,26.0,65.0,0,0,34.9,1,0,0,37.0,44.0,2.0,9.0,18.0,14,9.83,9.83,1,1,0,0,2,0,0,0,0,0,0,1.0,0,732.0,1308.0,0,1269.6,448000.0,1,0.0,1,1,0,0,0.0,0,1,0,0.0,36.3,40.5,0.0,7900.0
0,76,9.0,63.0,0,0,25.7,0,1,0,27.8,191.3,2.0,0.0,9.0,8,21.66,,1,1,1,0,1,0,0,0,1,0,1,1.0,0,899.0,900.0,1,718.6,252000.0,1,0.0,1,0,0,0,1.0,0,0,1,1.0,37.0,37.3,0.0,8100.0
0,56,,,0,0,18.4,0,0,0,23.8,,2.0,13.0,25.0,2,,,1,1,0,0,2,0,0,0,0,0,1,1.0,0,,,0,,314000.0,1,0.0,1,0,0,0,1.0,0,0,0,,38.1,39.4,0.0,9800.0
0,70,35.0,42.0,0,0,30.0,0,0,0,24.8,219.0,2.0,2.0,28.0,4,35.0,35.0,1,1,1,0,1,0,0,0,0,0,0,1.0,0,673.0,673.0,0,1838.0,174000.0,1,0.0,1,0,0,0,1.0,0,0,1,1.0,36.5,40.0,0.0,10600.0
0,77,28.0,5.0,0,0,19.1,0,0,0,38.2,73.9,2.0,,9.0,10,3.47,3.47,1,0,1,0,1,0,0,0,0,1,1,1.0,1,,,0,2394.0,276000.0,1,0.0,2,1,0,0,1.0,0,1,1,0.0,36.7,36.8,0.0,18500.0
0,90,34.0,16.0,0,0,25.7,1,0,0,24.4,97.4,2.0,,10.0,2,1.05,10.42,1,0,1,0,2,0,0,0,0,0,0,1.0,0,434.0,737.0,1,379.1,174000.0,0,0.0,2,0,0,0,1.0,0,0,0,1.0,36.2,38.0,0.0,6800.0
0,70,32.0,35.0,0,0,26.1,0,0,0,22.6,353.0,2.0,3.0,8.0,1,1.27,19.06,1,1,1,0,1,0,0,0,0,0,1,1.0,0,716.0,716.0,1,2194.0,479000.0,1,0.0,1,0,0,0,1.0,0,1,0,1.0,37.4,38.8,0.0,7500.0
0,67,25.0,45.0,0,0,26.2,0,0,1,23.3,268.0,2.0,13.0,15.0,2,0.7,15.6,1,1,0,0,1,0,0,0,0,0,0,1.0,0,207.0,2725.0,0,7500.0,283000.0,1,0.0,1,1,0,0,1.0,0,1,1,1.0,36.4,38.9,0.0,8100.0
0,87,32.0,62.0,0,0,33.0,0,0,1,29.4,264.3,2.0,,41.0,1,4.6,12.12,1,0,0,0,2,0,0,0,0,0,1,1.0,0,498.0,498.0,1,1869.0,127000.0,2,0.0,2,0,0,0,1.0,0,1,1,1.0,38.6,38.6,0.0,9200.0
0,72,8.0,91.0,0,0,25.6,0,0,0,23.8,348.0,2.0,,4.0,1,3.62,3.62,1,0,0,0,1,0,0,0,0,0,1,1.0,0,379.0,500.0,1,4500.0,175000.0,1,0.0,2,1,0,0,1.0,1,1,1,1.0,40.7,40.7,0.0,11000.0
0,35,93.0,37.0,1,0,39.8,0,1,0,25.6,251.0,2.0,0.0,13.0,7,5.73,18.2,1,1,0,0,1,0,0,0,0,0,0,1.0,0,1773.0,2296.0,0,7000.0,264000.0,1,0.0,1,0,0,0,1.0,0,0,1,1.0,36.6,38.4,1.0,12500.0
1,89,12.0,36.0,0,0,21.2,0,0,0,21.8,160.0,2.0,,1.0,2,1.35,1.98,1,0,1,0,1,0,0,0,0,0,1,1.0,0,422.0,422.0,1,324.2,186000.0,1,0.0,2,0,0,0,1.0,0,1,1,1.0,38.2,38.2,0.0,6600.0
0,67,30.0,67.0,0,0,39.4,0,0,0,29.5,211.3,1.0,0.0,13.0,3,35.2,35.2,1,1,0,0,1,0,0,0,0,0,0,0.0,0,1002.0,1002.0,0,1450.0,289000.0,1,0.0,1,0,0,0,1.0,0,0,1,1.0,36.1,38.0,1.0,22600.0
0,76,29.0,62.0,0,0,36.6,1,0,0,23.8,330.2,2.0,7.0,9.0,7,6.98,6.98,1,1,0,0,1,0,0,0,0,0,1,1.0,0,365.0,365.0,0,1346.4,467000.0,1,0.0,1,0,0,0,1.0,1,0,1,1.0,35.7,38.3,0.0,57000.0
0,67,56.0,104.0,0,0,22.3,1,0,0,17.8,278.1,2.0,0.0,16.0,1,2.21,2.21,1,1,1,0,1,0,0,0,0,0,1,1.0,0,731.0,731.0,1,3494.0,202000.0,1,0.0,1,1,0,0,1.0,0,1,1,1.0,38.3,39.4,0.0,9500.0
0,53,,,0,0,40.0,0,0,0,24.1,89.1,0.0,,4.0,1,1.45,1.45,1,0,1,0,1,0,0,0,0,0,1,1.0,0,448.0,448.0,0,4009.0,115000.0,1,0.0,2,1,0,0,1.0,0,0,1,0.0,36.8,39.9,0.0,4000.0
0,75,7.0,22.0,1,1,33.3,0,0,0,24.6,190.1,2.0,,11.0,3,4.24,7.11,1,0,1,0,2,0,0,0,0,0,1,1.0,1,246.0,511.0,1,492.5,105000.0,0,0.0,2,0,0,0,1.0,0,1,1,1.0,36.7,38.1,1.0,9700.0
0,74,24.0,71.0,0,0,17.5,1,0,0,39.3,167.7,2.0,0.0,39.0,1,35.2,35.2,1,1,0,0,1,0,0,0,0,0,1,1.0,1,618.0,382.0,1,2093.0,199000.0,2,0.0,1,0,1,0,1.0,0,1,0,1.0,36.1,39.9,0.0,19300.0
0,74,36.0,105.0,1,0,25.4,1,1,0,32.9,247.2,2.0,,2.0,3,1.5,1.5,1,0,1,0,1,0,0,0,0,0,1,1.0,0,676.0,676.0,1,352.6,256000.0,1,0.0,2,0,0,0,1.0,0,1,0,1.0,36.5,37.3,0.0,19700.0
0,58,34.0,52.0,0,0,19.3,0,0,1,27.4,266.4,2.0,1.0,20.0,1,1.0,1.0,1,1,0,0,2,0,0,0,0,0,1,1.0,0,339.0,354.0,1,1388.9,161000.0,0,0.0,1,0,0,0,1.0,0,0,0,1.0,38.1,39.0,0.0,9400.0
0,76,,,0,1,32.1,0,1,0,26.9,,2.0,0.0,25.0,14,,,1,1,1,1,1,0,0,0,0,0,0,1.0,1,,,0,,306000.0,1,0.0,1,0,0,0,1.0,1,0,1,1.0,36.0,39.3,0.0,25800.0
0,75,29.0,52.0,0,0,26.1,0,0,0,28.5,289.9,2.0,,5.0,3,2.43,2.43,1,0,1,0,1,0,0,0,0,0,1,1.0,0,431.0,431.0,1,483.4,246000.0,0,0.0,2,0,0,0,1.0,1,0,0,1.0,36.5,37.6,0.0,12600.0
0,61,60.0,150.0,0,0,23.0,0,0,0,39.2,125.0,1.0,0.0,17.0,1,5.25,5.72,1,1,1,0,1,0,0,0,0,0,0,0.0,0,,,0,1752.0,322000.0,1,0.0,1,0,0,0,1.0,0,1,1,1.0,30.6,39.2,0.0,20600.0
0,69,18.0,18.0,0,0,33.7,0,1,0,39.0,,0.0,,12.0,14,1.05,2.44,1,0,1,0,1,0,0,0,0,0,0,0.0,0,250.0,289.0,0,39.0,75000.0,1,0.0,2,0,0,0,0.0,0,0,0,0.0,36.8,39.3,0.0,4200.0
0,91,40.0,130.0,0,0,30.0,0,0,0,24.6,112.8,2.0,,9.0,3,1.94,1.94,1,0,0,0,2,0,0,1,0,0,1,0.0,0,531.0,531.0,0,415.0,182000.0,1,0.0,2,1,0,0,0.0,1,0,0,0.0,37.0,37.9,0.0,5300.0
0,70,164.0,98.0,0,0,35.9,0,0,0,33.9,85.4,2.0,0.0,0.0,2,,,1,1,0,0,1,0,0,0,0,0,1,0.0,0,803.0,803.0,0,2856.0,471000.0,1,0.0,1,1,0,0,0.0,0,0,0,0.0,35.7,36.6,0.0,38800.0
0,67,,,0,0,30.0,0,0,0,36.8,390.3,2.0,3.0,22.0,1,,,1,1,0,0,1,0,0,0,0,0,1,1.0,0,152.0,152.0,0,976.7,164000.0,1,0.0,1,0,0,0,1.0,0,0,1,1.0,36.9,39.3,0.0,15700.0
0,68,662.0,3033.0,0,0,28.9,1,0,0,33.8,259.3,2.0,18.0,26.0,27,,3.0,1,1,1,0,1,0,0,0,0,0,1,0.0,0,736.0,830.0,0,2779.0,88000.0,2,0.0,1,0,0,0,1.0,0,0,1,1.0,38.2,38.7,0.0,30600.0
0,95,22.0,47.0,0,0,30.0,0,0,0,24.6,287.6,2.0,,6.0,1,6.89,6.89,1,0,0,0,2,0,0,0,0,0,0,1.0,0,578.0,578.0,1,560.6,361000.0,1,0.0,2,0,0,0,1.0,0,0,0,1.0,36.0,37.8,0.0,9100.0
0,65,38.0,57.0,1,0,28.4,1,0,0,22.1,412.6,0.0,8.0,10.0,2,2.38,2.38,1,1,1,0,2,0,0,0,1,0,1,0.0,0,679.0,679.0,0,1801.0,373000.0,1,0.0,1,0,0,0,1.0,1,0,1,1.0,36.5,37.0,0.0,13700.0
1,73,22.0,25.0,0,0,19.5,0,0,1,39.2,,1.0,0.0,,2,0.77,0.77,1,1,0,0,1,0,0,0,1,0,1,1.0,0,402.0,400.0,1,96.6,284000.0,1,0.0,1,0,0,0,0.0,0,0,0,1.0,36.6,36.9,0.0,13500.0
0,73,23.0,66.0,0,0,31.1,0,1,0,40.7,,0.0,,10.0,4,1.19,,1,0,1,0,1,0,0,1,0,0,0,0.0,0,184.0,,1,443.2,115000.0,1,0.0,0,0,0,0,0.0,0,1,0,1.0,37.5,37.9,0.0,3800.0
0,66,6.0,16.0,0,0,30.0,0,0,1,39.3,,2.0,,18.0,4,1.9,,1,0,0,0,1,0,0,0,0,0,1,0.0,0,185.0,,0,,272000.0,1,0.0,2,1,0,0,0.0,0,0,1,1.0,36.7,38.3,0.0,13100.0
1,82,48.0,54.0,0,0,26.9,1,1,1,37.3,,2.0,,15.0,15,0.48,0.88,1,0,0,1,2,0,0,1,0,0,1,0.0,0,243.0,322.0,1,191.3,385000.0,1,0.0,2,0,0,0,1.0,0,0,0,1.0,36.2,37.1,0.0,6600.0
0,90,6.0,16.0,0,0,22.0,0,0,0,39.4,,,,16.0,5,3.96,3.96,1,0,0,0,1,0,0,0,1,0,0,0.0,0,300.0,300.0,0,17.2,226000.0,1,0.0,2,0,0,0,0.0,1,0,1,0.0,36.9,37.3,0.0,5200.0
0,67,60.0,79.0,0,0,30.0,0,0,0,21.5,29.7,2.0,5.0,16.0,7,2.69,15.04,1,1,0,0,1,0,0,0,0,0,1,1.0,0,590.0,596.0,0,1367.0,119000.0,1,0.0,1,0,0,0,1.0,1,1,1,1.0,36.7,38.0,1.0,9200.0
0,85,,,0,0,18.7,0,1,0,39.5,299.8,2.0,0.0,20.0,8,2.6,7.51,1,1,0,0,1,0,0,0,0,0,1,1.0,1,199.0,616.0,1,678.1,441000.0,2,0.0,1,1,1,0,1.0,0,1,1,1.0,35.7,38.1,0.0,9800.0
0,52,25.0,35.0,0,1,33.1,0,1,0,41.6,396.6,2.0,5.0,5.0,3,0.86,1.13,1,1,0,1,2,0,0,0,0,0,1,1.0,1,601.0,624.0,0,1513.0,346000.0,1,0.0,1,0,0,0,1.0,0,0,1,1.0,37.2,39.5,0.0,4800.0
0,62,6.0,16.0,0,0,21.0,0,0,0,41.1,9.6,2.0,,8.0,2,,,1,0,0,0,1,0,0,0,0,0,0,0.0,0,266.0,266.0,0,73.4,178000.0,2,0.0,2,0,0,0,0.0,0,1,0,0.0,37.0,38.1,0.0,93000.0
0,89,40.0,31.0,0,0,30.9,1,0,0,43.8,312.6,2.0,,0.0,1,3.0,3.0,1,0,1,0,2,0,0,0,0,0,1,0.0,1,173.0,173.0,1,1472.0,311000.0,1,0.0,2,1,1,0,1.0,0,1,1,0.0,39.2,39.2,0.0,87000.0
0,77,,,0,0,22.0,1,0,1,23.6,154.0,2.0,,1.0,1,35.2,35.2,1,0,1,0,2,0,0,0,0,0,0,0.0,1,773.0,773.0,1,511.7,156000.0,1,0.0,2,1,1,0,0.0,0,1,1,0.0,35.4,37.2,0.0,19500.0
0,74,20.0,45.0,0,0,38.9,1,0,0,33.3,438.1,2.0,0.0,0.0,1,7.4,7.4,1,1,0,0,2,0,0,0,0,0,1,0.0,0,620.0,620.0,1,4341.0,295000.0,1,0.0,1,0,0,0,1.0,0,1,0,0.0,35.8,39.3,0.0,29200.0
0,86,32.0,113.0,0,0,19.5,0,0,0,42.9,,1.0,0.0,1.0,3,,,1,1,0,0,1,0,0,0,0,0,1,0.0,0,,,1,,133000.0,1,0.0,1,0,0,0,0.0,0,1,0,0.0,39.5,39.5,0.0,15900.0
0,69,,,0,0,37.6,0,1,0,27.5,138.3,,,,20,,1.07,0,0,1,0,2,0,0,0,0,0,1,1.0,0,245.0,347.0,1,336.7,164000.0,1,0.0,2,0,0,0,0.0,0,0,1,0.0,39.0,39.1,0.0,5500.0
0,75,40.0,40.0,0,0,30.7,1,0,0,42.3,129.0,2.0,,,1,,,0,0,1,0,1,0,0,0,0,0,1,1.0,0,,,0,4000.0,81000.0,1,0.0,2,0,0,0,0.0,0,1,0,0.0,37.1,37.4,0.0,7000.0
0,82,,,0,0,20.9,0,0,0,37.1,,1.0,,,1,1.17,1.17,0,0,1,0,2,0,0,0,0,0,1,1.0,0,1727.0,1727.0,0,2065.0,352000.0,1,0.0,2,0,0,0,0.0,0,1,1,0.0,38.1,38.1,0.0,7000.0
0,74,,,0,0,47.6,0,0,0,42.9,144.1,,,,18,6.86,8.84,0,0,1,0,2,0,0,0,0,0,1,1.0,0,258.0,258.0,0,131.6,460000.0,1,0.0,2,0,0,0,1.0,1,0,1,1.0,38.7,38.7,0.0,8300.0
0,67,46.0,42.0,0,1,28.5,1,0,0,43.6,229.4,2.0,,,11,,8.59,0,0,0,0,1,0,0,0,0,0,1,1.0,1,784.0,784.0,0,7500.0,944000.0,1,0.0,2,0,0,0,1.0,0,0,1,1.0,37.7,37.7,0.0,11300.0
1,65,,,0,0,44.3,1,0,0,39.1,299.6,2.0,5.0,,35,,11.56,0,1,1,0,1,0,0,0,0,0,1,0.0,0,295.0,693.0,0,2353.0,270000.0,1,0.0,1,0,0,0,1.0,0,0,1,1.0,37.3,38.5,0.0,14300.0
0,67,,,0,0,28.3,0,0,0,34.2,,1.0,,,9,,,0,0,0,0,2,0,0,0,0,0,1,0.0,1,,,0,,197000.0,1,0.0,0,0,0,1,0.0,1,0,0,0.0,37.5,37.5,0.0,4600.0
0,72,,,0,0,23.0,0,1,0,43.4,,,,,15,,4.07,0,0,1,1,1,0,0,0,0,0,1,1.0,0,857.0,857.0,0,,161000.0,1,0.0,2,1,0,0,1.0,0,1,1,1.0,36.8,37.7,0.0,5600.0
0,74,,,0,0,24.2,1,0,0,28.8,,,,,2,,,0,0,1,0,2,0,0,0,0,0,1,0.0,0,,,1,580.3,324000.0,1,0.0,2,0,0,0,1.0,0,0,1,1.0,37.1,39.5,0.0,8100.0
1,67,1748.0,4412.0,0,0,38.9,0,1,0,37.2,140.0,1.0,4.0,,23,,,0,1,1,0,2,0,0,0,0,0,1,1.0,0,2500.0,6000.0,0,450.0,300000.0,1,0.0,1,0,0,0,1.0,1,0,1,1.0,39.2,39.2,0.0,10000.0